{"text_format":"1","workbook":"xlsx","n_sheets":8,"sheets":["VPP Hand-Off Form","Supporting Documents","Instructions","Part # and Part Description","Output (BBY)","LOV","UOM Conversion","Sheet1"],"not_rendered":{"charts":0,"images":1,"macros":1,"external_links":0,"defined_names":7,"comments":2,"pivot_tables":0},"unopened":[],"bounds":{"document_bytes":16777216,"sheet_cells":100000,"rows_first":2000,"rows_last":500,"rows_between":2000,"halvings":0,"cell_chars":16384,"cell_head_chars":4096},"cells_cut":0,"cells_raw":0,"read":"whole","date_system":"1900"}

{"sheet":"VPP Hand-Off Form","index":0,"n_rows":9,"n_cols":30,"rows_kept":9,"cut":false,"hidden":false,"merged":[[0,0,0,5],[7,18,7,23],[7,24,7,29],[7,9,7,11],[2,3,2,5],[1,0,1,5]]}
["VPP/VPD Part Hand-Off Form - Updated 7.26.23"]
["To be Filled in by Best Buy Project Manager"]
["WRF Description:",null,"WRF #:"]
["Best Buy Contact:",null,"Category:",null,"Deployment Date:"]
["OEM Contact Name:",null,"Planogram Title:",null,"Deployment Labor:"]
["OEM Contact Email:",null,"Display Name:",null,"Delivery Method for Initial Deployment:"]
["….....................................................................................","…......................................................................................................................................................................................................................................................................................."]
["Max of 40 Characters - No Spaces","Max of 140 Characters","Is a requirment to be added to capture at time of part set up",null,"Full Kit should only be used for the Full Fixture. \nThis should only be on 1  line of this form.","How is this part \npackaged when ordered.","Graphic, Content, Fixture, Electronic","To be filled out by Space","Fill in version information if display is different in mulitple locations\n\nTo be filled out by Space","Kit/Part Dimensions - Entered in Inches without symbol (\")",null,null,null,null,"Per Store","Include Production & Shipping.  Provide in Days.",null,"These items require \nspecial disposal and \nmay cause additional \nfees to remove.","Who is the vendor/supplier for deploying the fixture for 1st time arrival in stores",null,null,null,null,null,"Who is the vendor/supplier that will hold inventory and fulfill Repair & Maintenance Orders"]
{"$rows_left_out":2}
{"sheet":"Supporting Documents","index":1,"n_rows":1,"n_cols":2,"rows_kept":1,"cut":false,"hidden":false,"merged":[]}
["Install","Display Schematic"]

{"sheet":"Instructions","index":2,"n_rows":32,"n_cols":2,"rows_kept":32,"cut":false,"hidden":false,"merged":[[18,0,18,1],[25,0,25,1]]}
["Required Information","Instructions/Definitions"]
["VPP Part Number","See Part # and Part Description Tab"]
["VPP Description ","See Part # and Part Description Tab"]
["Retek Sku #","The Retek sku will be added in by Best Buy Project Management Team.  This will associate any Retek sku that will be used as a display, and will need to be updated when ever in changes out."]
["Add, Keep, Obsolete-All or Obsolete-Partial","If you are deploying the display for the first time in Best Buy stores, you will select \"Add\".  If you are refreshing components of an existing display already in Best Buy stores, you will identify each part with an \"Add\" for new parts, \"Keep\" for parts that are staying on the display, and \"Obsolete-All\" or \"Obsolete-Partial\" if parts are being removed from the display.   When selecting \"Obsolete-All\", you are indicating that this part is being removed from all displays supporting this Planogram Title.  When selecting \"Obsolete-Partial\", you are indicating that this part is only being removed from some display(s) that support an option or version of the same Planogram Title."]
["Identify option or version subtitle(s) if applicable","If there are different displays created to support different Plano Title Options or Versions, this column will be used to list out the option or version subtitle(s) at the part level for the corresponding display."]
["Obsolete Partial:  Identify which option or version subtitle(S) that should be made obsolete","If there are different displays created to support different Plano Title Options or Versions and only one or some of these are being removed from the stores, you will need to indicate which option or version subtitle(s) should be obsoleted.  "]
["Full Kit, Partial Kit or Part","A Full Kit is a single part number that will include all parts to make up an entire display.  The Full Kit part will only be orderable by Corporate for projects such as relocations, remodels, disaster recovery or future display expansion.   Partial Kit is a subset of parts within the full display that will be identified by 1 part number and will always be shipped together.  For example, this can be used for parts that require the vendor to put together prior to being sent to a store or for a refresh kit of parts.   A Part is an individual component of the complete display.  It is recommended that you breakdown your display as much as you can at the individual part level in order to keep repair & maintenance costs to a minimum.  If you do not supply individual part level hand-off of all parts required to build the full display, we will leave the Full Kit part number on PRiMe for repair & maintenance ordering."]
{"$rows_left_out":25}
{"sheet":"Part # and Part Description","index":3,"n_rows":94,"n_cols":2,"rows_kept":94,"cut":false,"hidden":false,"merged":[[55,0,55,1],[56,0,56,1],[82,0,82,1],[83,0,83,1],[27,0,27,1],[28,0,28,1],[29,0,29,1],[30,0,30,1],[35,0,35,1],[37,0,37,1],[38,0,38,1],[40,0,40,1],[41,0,41,1],[42,0,42,1],[18,1,18,2],[19,0,19,1],[20,0,20,1],[21,0,21,1],[10,0,11,0],[10,1,10,2],[11,1,11,2],[12,1,12,2],[13,1,13,2],[14,1,14,2],[15,1,15,2],[16,1,16,2],[17,1,17,2],[6,0,6,1],[6,2,9,2],[7,0,7,1],[8,0,8,1],[9,0,9,1],[0,0,0,1],[1,0,1,1],[2,0,2,1],[3,0,3,1],[3,2,5,2],[4,0,4,1],[5,0,5,1],[44,2,45,2],[23,0,23,1],[24,0,24,1],[25,0,25,1],[26,0,26,1],[36,0,36,1]]}
["Part Number:"]
["Graphics & Content Delivery devices:  "]
["·         Best Buy will create and provide part numbers for these part types"]
["·         Best Buy part numbers MUST be printed on the bottom lower right corner for all graphic parts"]
[]
["Fixtures, Electronics, and Kits:"]
["·         The vendor/supplier will provide part numbers for these part types"]
["·         The VPP part numbers should be unique and specific to the parts within one display"]
{"$rows_left_out":87}
{"sheet":"Output (BBY)","index":4,"n_rows":202,"n_cols":42,"rows_kept":202,"cut":false,"hidden":true,"merged":[]}
["Uncheck all 0's",null,null,null,"Status",null,null,"Grid","Formula Do Not Remove",null,"Item DFF"," Department","Warranty"," Capitalization","Web Active Date","Web Inactive Date","ABC Class","Product Group ID"," WRF Number"," Parent Item"," Item Replacement","Merch Kit - Customer's Name","Project / Campaign Name","POG Title","Supplier Name","Manufacturer Name",null,"UOM_Code",null,null,null,null,"Purchasing",null,null,null,null,"Physical","W","H","D","DO NOT DELETE"]
["Item Number","Description","Template",null,"Catalog Interface ID","Catalog Messages",null,"Category Set","Category",null,"Item Context","Item Attribute1","Item Attribute2","Item Attribute3","Item Attribute4","Item Attribute5","Item Attribute6",null,"Item Attribute12","Item Attribute13","Item Attribute14","Item Attribute15","Item Attribute16","Item Attribute17","Item Attribute20","Item Attribute21",null,"Primary UOM","User Item Type","Item Status","Long Description",null,"Unit of Issue","Hazard Class","Receipt Close Tolerance","Invoice Close Tolerance",null,"Dimension UOM","Width","Height","Depth"]
[{"$f":"IF('VPP Hand-Off Form'!D10=\"Obsolete\",0,IF('VPP Hand-Off Form'!D10=\"Keep\",0,IF('VPP Hand-Off Form'!D10=\"Obsolete-Partial\",0,'VPP Hand-Off Form'!A10)))","v":0},{"$f":"IF('VPP Hand-Off Form'!D10=\"Obsolete\",\"0\",IF('VPP Hand-Off Form'!D10=\"Keep\",\"0\",IF('VPP Hand-Off Form'!D10=\"Obsolete-Partial\",\"0\",'VPP Hand-Off Form'!B10)))","v":0},{"$f":"IFERROR(IF(A3=0,\"\",VLOOKUP(A3,parts,8,FALSE)),\"NA\")","v":""},null,null,null,null,{"$f":"IF(A3=0,\"\",\"BBY_PURCHASING\")","v":""},{"$f":"IF(A3=0,\"\",'VPP Hand-Off Form'!#REF!)","v":""},null,{"$f":"IF(A3=0,\"\",\"Non-Merch Inventory\")","v":""},{"$f":"IF(A3=0,\"\",'VPP Hand-Off Form'!#REF!)","v":""},{"$f":"IF(A3=0,\"\",\"\")","v":""},null,null,null,{"$f":"IF(LEFT(A3,3)=\"VPP\",\"V\",IF(LEFT(A3,2)=\"b0\",\"H\",IF(ISBLANK(A3),\"\",\"H\")))","v":"H"},{"$f":"IF(AP3=\"Full Kit\",16001,IF(AC3=\"VPP - SUPPLIES\",10100,IF(AC3=\"VPP - FIXTURE\",16002,IF(AC3=\"VPP - ELECTRONIC\",16003,IF(AC3=\"VPP - GRAPHIC PERM\",18000,IF(AC3=\"VPP - GRAPHIC-TEMP\",18000,\"\"))))))","v":""},{"$f":"IF(A3=0,\"\",'VPP Hand-Off Form'!$B$3)","v":""},null,null,{"$f":"IF(A3=0,\"\",'VPP Hand-Off Form'!$B$4)","v":""},{"$f":"IF(A3=0,\"\",'VPP Hand-Off Form'!#REF!)","v":""},{"$f":"IF(A3=0,\"\",'VPP Hand-Off Form'!#REF!)","v":""},{"$f":"IFERROR(IF(A3=0,\"\",VLOOKUP(A3,parts,25,FALSE)),\"NA\")","v":""},{"$f":"IFERROR(IF(A3=0,\"\",VLOOKUP(A3,parts,25,FALSE)),\"NA\")","v":""},null,{"$f":"IFERROR(IF(A3=0,\"\",VLOOKUP(A3,parts,8,FALSE)),\"NA\")","v":""},{"$f":"IFERROR(IF(A3=0,\"\",VLOOKUP(A3,parts,9,FALSE)),\"NA\")","v":""},{"$f":"IF(A3=0,\"\",IF(ISBLANK('Output (BBY)'!A3),\"\",\"Created\"))","v":""},null,null,null,{"$f":"IF(A3=0,\"\",IF(ISBLANK('VPP Hand-Off Form'!R10),\"\",\"99\"))","v":""},null,null,null,{"$f":"IF(A3=0,\"\",\"IN\")","v":""},{"$f":"IFERROR(IF(A3=0,\"\",VLOOKUP(A3,parts,10,FALSE)),\"NA\")","v":""},{"$f":"IFERROR(IF(A3=0,\"\",VLOOKUP(A3,parts,11,FALSE)),\"NA\")","v":""},{"$f":"IFERROR(IF(A3=0,\"\",VLOOKUP(A3,parts,12,FALSE)),\"NA\")","v":""},{"$f":"IF(ISBLANK('VPP Hand-Off Form'!E10),\"\",'VPP Hand-Off Form'!E10)","v":""}]
[{"$f":"IF('VPP Hand-Off Form'!D11=\"Obsolete\",0,IF('VPP Hand-Off Form'!D11=\"Keep\",0,IF('VPP Hand-Off Form'!D11=\"Obsolete-Partial\",0,'VPP Hand-Off Form'!A11)))","v":0},{"$f":"IF('VPP Hand-Off Form'!D11=\"Obsolete\",\"0\",IF('VPP Hand-Off Form'!D11=\"Keep\",\"0\",IF('VPP Hand-Off Form'!D11=\"Obsolete-Partial\",\"0\",'VPP Hand-Off Form'!B11)))","v":0},"",null,null,null,null,"",{"$f":"IF(A4=0,\"\",'VPP Hand-Off Form'!#REF!)","v":""},null,{"$f":"IF(A4=0,\"\",\"Non-Merch Inventory\")","v":""},{"$f":"IF(A4=0,\"\",'VPP Hand-Off Form'!#REF!)","v":""},{"$f":"IF(A4=0,\"\",\"\")","v":""},null,null,null,{"$f":"IF(LEFT(A4,3)=\"VPP\",\"V\",IF(LEFT(A4,2)=\"b0\",\"H\",IF(ISBLANK(A4),\"\",\"H\")))","v":"H"},{"$f":"IF(AP4=\"Full Kit\",16001,IF(AC4=\"VPP - SUPPLIES\",10100,IF(AC4=\"VPP - FIXTURE\",16002,IF(AC4=\"VPP - ELECTRONIC\",16003,IF(AC4=\"VPP - GRAPHIC PERM\",18000,IF(AC4=\"VPP - GRAPHIC-TEMP\",18000,\"\"))))))","v":""},{"$f":"IF(A4=0,\"\",'VPP Hand-Off Form'!$B$3)","v":""},null,null,{"$f":"IF(A4=0,\"\",'VPP Hand-Off Form'!$B$4)","v":""},{"$f":"IF(A4=0,\"\",'VPP Hand-Off Form'!#REF!)","v":""},{"$f":"IF(A4=0,\"\",'VPP Hand-Off Form'!#REF!)","v":""},"","",null,"","",{"$f":"IF(A4=0,\"\",IF(ISBLANK('Output (BBY)'!A4),\"\",\"Created\"))","v":""},null,null,null,{"$f":"IF(A4=0,\"\",IF(ISBLANK('VPP Hand-Off Form'!R11),\"\",\"99\"))","v":""},null,null,null,{"$f":"IF(A4=0,\"\",\"IN\")","v":""},"","","",{"$f":"IF(ISBLANK('VPP Hand-Off Form'!E11),\"\",'VPP Hand-Off Form'!E11)","v":""}]
[{"$f":"IF('VPP Hand-Off Form'!D12=\"Obsolete\",0,IF('VPP Hand-Off Form'!D12=\"Keep\",0,IF('VPP Hand-Off Form'!D12=\"Obsolete-Partial\",0,'VPP Hand-Off Form'!A12)))","v":0},{"$f":"IF('VPP Hand-Off Form'!D12=\"Obsolete\",\"0\",IF('VPP Hand-Off Form'!D12=\"Keep\",\"0\",IF('VPP Hand-Off Form'!D12=\"Obsolete-Partial\",\"0\",'VPP Hand-Off Form'!B12)))","v":0},"",null,null,null,null,{"$f":"IF(A5=0,\"\",\"BBY_PURCHASING\")","v":""},{"$f":"IF(A5=0,\"\",'VPP Hand-Off Form'!#REF!)","v":""},null,"",{"$f":"IF(A5=0,\"\",'VPP Hand-Off Form'!#REF!)","v":""},"",null,null,null,"H","",{"$f":"IF(A5=0,\"\",'VPP Hand-Off Form'!$B$3)","v":""},null,null,{"$f":"IF(A5=0,\"\",'VPP Hand-Off Form'!$B$4)","v":""},{"$f":"IF(A5=0,\"\",'VPP Hand-Off Form'!#REF!)","v":""},{"$f":"IF(A5=0,\"\",'VPP Hand-Off Form'!#REF!)","v":""},"","",null,"","",{"$f":"IF(A5=0,\"\",IF(ISBLANK('Output (BBY)'!A5),\"\",\"Created\"))","v":""},null,null,null,{"$f":"IF(A5=0,\"\",IF(ISBLANK('VPP Hand-Off Form'!R12),\"\",\"99\"))","v":""},null,null,null,"","","","",{"$f":"IF(ISBLANK('VPP Hand-Off Form'!E12),\"\",'VPP Hand-Off Form'!E12)","v":""}]
[{"$f":"IF('VPP Hand-Off Form'!D13=\"Obsolete\",0,IF('VPP Hand-Off Form'!D13=\"Keep\",0,IF('VPP Hand-Off Form'!D13=\"Obsolete-Partial\",0,'VPP Hand-Off Form'!A13)))","v":0},{"$f":"IF('VPP Hand-Off Form'!D13=\"Obsolete\",\"0\",IF('VPP Hand-Off Form'!D13=\"Keep\",\"0\",IF('VPP Hand-Off Form'!D13=\"Obsolete-Partial\",\"0\",'VPP Hand-Off Form'!B13)))","v":0},"",null,null,null,null,{"$f":"IF(A6=0,\"\",\"BBY_PURCHASING\")","v":""},{"$f":"IF(A6=0,\"\",'VPP Hand-Off Form'!#REF!)","v":""},null,"",{"$f":"IF(A6=0,\"\",'VPP Hand-Off Form'!#REF!)","v":""},"",null,null,null,"H","",{"$f":"IF(A6=0,\"\",'VPP Hand-Off Form'!$B$3)","v":""},null,null,{"$f":"IF(A6=0,\"\",'VPP Hand-Off Form'!$B$4)","v":""},{"$f":"IF(A6=0,\"\",'VPP Hand-Off Form'!#REF!)","v":""},{"$f":"IF(A6=0,\"\",'VPP Hand-Off Form'!#REF!)","v":""},"","",null,"","",{"$f":"IF(A6=0,\"\",IF(ISBLANK('Output (BBY)'!A6),\"\",\"Created\"))","v":""},null,null,null,{"$f":"IF(A6=0,\"\",IF(ISBLANK('VPP Hand-Off Form'!R13),\"\",\"99\"))","v":""},null,null,null,"","","","",{"$f":"IF(ISBLANK('VPP Hand-Off Form'!E13),\"\",'VPP Hand-Off Form'!E13)","v":""}]
[{"$f":"IF('VPP Hand-Off Form'!D14=\"Obsolete\",0,IF('VPP Hand-Off Form'!D14=\"Keep\",0,IF('VPP Hand-Off Form'!D14=\"Obsolete-Partial\",0,'VPP Hand-Off Form'!A14)))","v":0},{"$f":"IF('VPP Hand-Off Form'!D14=\"Obsolete\",\"0\",IF('VPP Hand-Off Form'!D14=\"Keep\",\"0\",IF('VPP Hand-Off Form'!D14=\"Obsolete-Partial\",\"0\",'VPP Hand-Off Form'!B14)))","v":0},"",null,null,null,null,"",{"$f":"IF(A7=0,\"\",'VPP Hand-Off Form'!#REF!)","v":""},null,"",{"$f":"IF(A7=0,\"\",'VPP Hand-Off Form'!#REF!)","v":""},"",null,null,null,"H","",{"$f":"IF(A7=0,\"\",'VPP Hand-Off Form'!$B$3)","v":""},null,null,{"$f":"IF(A7=0,\"\",'VPP Hand-Off Form'!$B$4)","v":""},{"$f":"IF(A7=0,\"\",'VPP Hand-Off Form'!#REF!)","v":""},{"$f":"IF(A7=0,\"\",'VPP Hand-Off Form'!#REF!)","v":""},"","",null,"","",{"$f":"IF(A7=0,\"\",IF(ISBLANK('Output (BBY)'!A7),\"\",\"Created\"))","v":""},null,null,null,{"$f":"IF(A7=0,\"\",IF(ISBLANK('VPP Hand-Off Form'!R14),\"\",\"99\"))","v":""},null,null,null,"","","","",{"$f":"IF(ISBLANK('VPP Hand-Off Form'!E14),\"\",'VPP Hand-Off Form'!E14)","v":""}]
[{"$f":"IF('VPP Hand-Off Form'!D15=\"Obsolete\",0,IF('VPP Hand-Off Form'!D15=\"Keep\",0,IF('VPP Hand-Off Form'!D15=\"Obsolete-Partial\",0,'VPP Hand-Off Form'!A15)))","v":0},{"$f":"IF('VPP Hand-Off Form'!D15=\"Obsolete\",\"0\",IF('VPP Hand-Off Form'!D15=\"Keep\",\"0\",IF('VPP Hand-Off Form'!D15=\"Obsolete-Partial\",\"0\",'VPP Hand-Off Form'!B15)))","v":0},"",null,null,null,null,"",{"$f":"IF(A8=0,\"\",'VPP Hand-Off Form'!#REF!)","v":""},null,"",{"$f":"IF(A8=0,\"\",'VPP Hand-Off Form'!#REF!)","v":""},"",null,null,null,"H","",{"$f":"IF(A8=0,\"\",'VPP Hand-Off Form'!$B$3)","v":""},null,null,{"$f":"IF(A8=0,\"\",'VPP Hand-Off Form'!$B$4)","v":""},{"$f":"IF(A8=0,\"\",'VPP Hand-Off Form'!#REF!)","v":""},{"$f":"IF(A8=0,\"\",'VPP Hand-Off Form'!#REF!)","v":""},"","",null,"","",{"$f":"IF(A8=0,\"\",IF(ISBLANK('Output (BBY)'!A8),\"\",\"Created\"))","v":""},null,null,null,{"$f":"IF(A8=0,\"\",IF(ISBLANK('VPP Hand-Off Form'!R15),\"\",\"99\"))","v":""},null,null,null,"","","","",{"$f":"IF(ISBLANK('VPP Hand-Off Form'!E15),\"\",'VPP Hand-Off Form'!E15)","v":""}]
{"$rows_left_out":195}
{"sheet":"LOV","index":5,"n_rows":338,"n_cols":74,"rows_kept":338,"cut":false,"hidden":true,"merged":[[0,17,0,19],[0,1,0,2],[0,3,0,4],[0,5,0,7],[0,8,0,9],[0,10,0,15]]}
[null,"XX_DEPARTMENT_LOV",null,"XX_WARRANTY_LOV",null,"XX_CAPITALIZATION_LOV",null,null,"XX_ABC_CLASS",null,"XX_PRODUCT_GROUP_ID",null,null,null,null,null,null,"Orgs",null,null,"Item Status","Hazard","Part Type","Capitalize",null,"Item Status",null,null,null,null,null,null,null,"BAG",null,"Description","Sourcing Team","Store Group","Project ID","PO Type","Job Status","Supplier Name",null,null,null,null,"Job Type",null,"Requestor","ID",null,"Update",null,null,null,"Concatenate","Category",null,"Supplier Name","Supplier Number",null,"Lead Time",null,"Item Types",null,null,"Item or Item Org Part?"]
[null,"Value","Description","Value","Description","Value","Description","DFF","Value","Description","Value","Description","Inv Acct","Exp Acct","MK Acct","Movable","Project E-Type","Name","Organization Code","Use ","Active",null,"Electronic",null,"BBY Electronic Item","Created",null,null,"Temp part","100,S01, T01",null,null,null,"BOTTLE",null,"Appliances","Buying Services","PR Stores",500,"Direct Ship","Ready for PO","3C STORE FIXTURES INC",500,"Replenishment","to","Stores","CER Project",null,"Brian Mapp","A338099",1007,"New",null,null,null,"Appliances10100",98000101,null,"3C STORE FIXTURES INC",550242880,null,"BBY-Graphics =28 Days",null,"BBY Electronics","70 Days",null,"Item",null,"Electronic","70 Days","BBY Electronic Item",null,null,{"$error":"#REF!"}]
[null,"Appliances","Appliances","Warranty 1 year","Warranty 1 year","Capitalize","Capitalize",400,"A","Class A - 1.5",10100,"Supplies",13800,73101,86000,"Yes","77101-Supplies","BBY - US Inventory Org",100,"Master Org","Created",99,"Fixture","Capitalize","BBY Fixture Item",null,null,null,"Perm graphic","100, s01, t01",null,null,null,"BOX",null,"BBFB","GNFR Plng","US Stores",1001,"Ship to Consolidator","Open","AAMP OF AMERICA INC",1001,"DI",null,null,"Non-CER Project",null,"Anthony Israel","A845042",1007,"Update","Fixtures","BBY Fixture Item",null,"Appliances16001",98000201,null,"AAMP OF AMERICA INC",543620000,null,"BBY-Fixtures =56 Days",null,"BBY Fixture","56 Days",null,"Item Org",null,"Fixture","56 Days","BBY Fixture Item",null,null,{"$error":"#REF!"}]
[null,"BBFB","BBFB","Warranty 1 year S/N Required","Warranty 1 year S/N Required","Expense","Expense",8.1999999999999993,"B","Class B - 2.0",16001,"Fixtures Non-merchandisable",14803,73160,86160,"No","77160-Fixtures Warehouse","Best Buy Stores","S01","No Inventory","Expired",null,"Graphics - Temp",null,"BBY Graphic Item",null,null,null,"Fixture Electronic","100,S01,T01","Direct to store only (unless riding with the merch kit then add TPL Merch)",null,null,"BUNDLE",null,"BBY Express","Sciquest","US and PR Stores",1002,null,null,"ACME PRESS INC DBA CALITHO",1002,"Computing",null,null,null,null,"Christopher Tri","A1183505",1004,"Obsolete","Electronics","BBY Electronic Item",null,"Appliances16002",98000301,null,"ACME PRESS INC DBA CALITHO",550283131,null,"BBY-Supplies =49 Days",null,"BBY Graphics","28 Days",null,null,null,"Supplies","49 Days","BBY Supplies Item",null,null,{"$error":"#REF!"}]
[null,"BBY Express","BBY Express","Warranty 2 year","Warranty 2 year",null,null,null,"C","Class C - 3.0",16002,"Fixtures Merchandisable",14803,73160,86160,"Yes","77160-Fixtures Customer Facing","TPL MERCH","T01","No Inventory","Expires when gone",null,"Graphics - Perm",null,"BBY Supplies Item",null,null,null,"VPP","100,S01, T01",null,null,null,"CAN",null,"BBY Mobile","Sourcing",null,1004,null,null,"ACME PRESS INC DBA CALITHO",1004,"ME",null,null,null,null,"Todd Kollodge","A1184445",5047,null,"Supplies",null,null,"Appliances16003",98000401,null,"ACME PRESS INC DBA CALITHO",550283131,null,"BBY-Electronics =70 Days",null,"BBY Supplies","49 Days",null,null,null,"BBY Graphic Item","28 Days",null,null,null,{"$error":"#REF!"}]
[null,"BBY Mobile","BBY Mobile","Warranty 2 year S/N Required","Warranty 2 year S/N Required",null,null,null,"D","Class D - 4.0",16003,"Electronics",14803,73160,86160,"Yes","77160-Electronics","TPL R&M","T02","Inventory","GNFR Rev.",null,"Supplies",null,"BBY VPP - Electronic Item",null,null,null,null,null,null,null,null,"CARTON",null,"BBY Mobile SAS",null,null,1005,null,null,"ACOUSTICAL SURFACES INC",1005,"Laptops",null,null,null,null,"Allison Hendel","A1209665",1004,null,null,null,null,"Appliances18000",98000501,null,"ACOUSTICAL SURFACES INC",550187469,null,"VPP All types =21 Days",null,"VPP Electronics","21 Days",null,null,null,"BBY VPP - Electronic Item","21 Days",null,null,null,"49 Days"]
[null,"BBY Mobile SAS","BBY Mobile SAS","Warranty 3 year","Warranty 3 year",null,null,null,"E","Class E - 6.0",18000,"Graphics",13800,73180,86180,"Yes","77180-Graphics","TPL Projects","T03","Inventory","Proc. Ops.",null,"VPP - Electronic",null,"BBY VPP - Fixture Item",null,null,null,null,null,null,null,null,"CONTAINER",null,"Cellular",null,null,1006,null,null,"ACRYLIC DESIGN ASSOCIATES",1006,"HT",null,null,null,null,"Jon Knez","A297903",5047,null,null,null,null,"BBFB16001",98000102,null,"ACRYLIC DESIGN ASSOCIATES",550015388,null,null,null,"VPP Fixture","21 Days",null,null,null,"BBY VPP - Fixture Item","21 Days",null,null,null,{"$error":"#N/A"}]
[null,"Cellular","Cellular","Warranty 3 year S/N Required","Warranty 3 year S/N Required",null,null,null,"F","Class F - 9.0",null,null,null,null,null,null,null,"ACRYLIC DESIGN ASSOCIATES","V01","Inventory","Graphics",null,"VPP - Fixture",null,"BBY VPP - Graphic Item",null,null,null,"Best Buy Stores","S01","All parts assigned",null,null,"CRATE",null,"Check Out",null,null,1007,null,null,"ACTIONLINK LLC",1007,"Majors",null,null,null,null,"Elizabeth Kraetsch","A581895",1007,null,null,null,null,"BBFB16002",98000202,null,"ACTIONLINK LLC",550058587,null,null,null,"VPP Graphics","21 Days",null,null,null,"BBY VPP - Graphic Item","21 Days",null,null,null,{"$error":"#N/A"}]
{"$rows_left_out":331}
{"sheet":"UOM Conversion","index":6,"n_rows":184,"n_cols":2,"rows_kept":184,"cut":false,"hidden":true,"merged":[]}
["UNIT_OF_MEASURE","UOM_CODE"]
["Bag","G01"]
["Bag of 10","G10"]
["Bag of 100","G1H"]
["Bag of 1000","G1K"]
["Bag of 12","G12"]
["Bag of 150","GH1"]
["Bag of 2","G02"]
{"$rows_left_out":177}
{"sheet":"Sheet1","index":7,"n_rows":18,"n_cols":1,"rows_kept":18,"cut":false,"hidden":true,"merged":[]}
[]
["Keep"]
["Add"]
["Obsolete"]
[]
[]
[]
["Blue Shirt"]
{"$rows_left_out":10}